Error Redefinition Of Function

RECOMMENDED: If you have Windows errors then we strongly recommend that you download and run this (Windows) Repair Tool.

Oct 31, 2014. The error that you are getting at the end error: redefinition of 'class. In function ' void setup()': hotfishies.cpp:65:3: error: 'display' was not.

hey guys, total newbie question here, but on this program I am writing I am, all of the sudden, getting an error saying 'redefinition of 'show_al

I am using two stacks to implement a queue class. My header file looks like: #ifndef _MyQueue_h #define _MyQueue_h using namespace std; template <typename T>.

Question: I’m trying to alter a table, and I get an ORA-00054, from what appears to be a locking problem: alter table mytab add newcol char

Sep 14, 2014. include #include char input[] = "the sky is blue "; char output[128]; int main() { char *pe = input + strlen(input)-1; char *p = NULL, *t; int idx = 0;.

Redefinition of function. Ask Question. up vote 0 down vote favorite. I have one file example1.cpp with the main function. Redefinition of Functions Error-1.

Array row counts and batch error handling for array operations. Support for Edition Based Redefinition. Easily switch applications to use updated PL/SQL logic.

Jun 21, 2014. Step Two: Resolve Any Duplicate Function Names By Renaming The. In function 'void setup()': Blink_Fade:39: error: redefinition of 'void.

For example, asked why so many are foreign born, and so many are Dominican, prosecutors said it had probably been a function of where the drugs were coming from and how they were distributed. "A lot of drugs are coming from South.

Error Reason Code 1708 Destiny 2 error codes are something you’ll encounter if something has gone. If, Jan 28, 2009. The following script will help in getting the Exit/Error code of Application installation else

Redefinition of Class Error. Redefinition of Class Error. error: redefinition of 'class NameModel. In function 'int main.

I actually received two error messages: speller.c:217:5: error: redefinition of 'main' int main(int argc, char *argv[]) ^ speller.c:20:5: note: previous definition.

Illegal redefinition of variable "name" (Error 1960). Cannot nest aggregate functions (Error 1844) Cannot nest class definitions (Error 1926)

Aug 18, 2011. Summary: compilation error: gs/base/time_.h:49:8: error: redefinition of. gs/base /pipe_.h:39:1: warning: function declaration isn't a prototype.

Caution: This chapter is under repair! This chapter describes SWIG’s support of Python. SWIG is compatible with most recent Python versions including Python 3.0 and.

Echocardiography is the imaging method of choice in the evaluation of patients with heart failure (HF) due to its accuracy, availability, low cost and safety profile.

Feb 8, 2016. Fatal error: Redefinition of parameter $source in. Call Stack # Time Memory Function Location 1 0.0006 365592 {main}( )./index.php:0 2.

The original model predicted body weight with an error of 19.7% vs. 5.7% for the revised model. Based on these.

Five more things to unlearn about Oracle – To obtain the current date and time in TIMESTAMP format, use the SYSTIMESTAMP function instead of SYSDATE. For example: where <filenumber> and <blocknumber> were the numbers from the error message. SQL package called.

sbcl This manual is part of the SBCL software system. See the README file for more information. This manual is largely derived from the manual for the CMUCL system.

RECOMMENDED: Click here to fix Windows errors and improve system performance