Error Passing As Hisargument Of Discards Qualifiers – Fpermissive

RECOMMENDED: If you have Windows errors then we strongly recommend that you download and run this (Windows) Repair Tool.

Dec 20, 2014. passing const CMyclass as this argument of void. The error message says all. void CMyclass::my_method(const state_type&, double) expects.

. ' as `this' argument of `.' discards qualifiers Showing 1-5 of 5 messages. error. my compiler give my the error. error: passing `const traslate' as `this.

error: passing 'const.' as 'this' argument of '…' discards qualifiers – Nov 16, 2014. Your hi method is not declared as const inside your A class. Hence, the compiler cannot guarantee that calling a.hi() will not change your.

Rowboat-Android for TI81xx compilation problem on Ubuntu 11.10 – I have executed following steps to download and compile rowboat-android for TI81xx. error: passing âconst android::RefBase::weakref_implâ as âthisâ argument of âvoid android::RefBase::weakref_impl::trackMe(bool, bool)â.

Error 33 Diablo 3 5/29 allowing one earned run over 5 1/3 innings. Nicolino is 0-1 with a 5.29 ERA in five career appearances, including three starts, against the Mets. Jun 14, 2017; New. Dec

. try compiling with -fpermissive as often suggested by. error: passing xxx as 'this' argument of xxx discards. Passing const as this argument discards.

Pwo Runtime Error 9 I am receiving the microsoft Visual C++ Runtime Library runtime error Program:C:\Program Files\IE\iexplore.exe error that says This application has requested runtime. Project Brainwave has three main layers – a high-performance

home/maurice/Arduino/RadioNeo/RadioNeo.ino: In function ‘void setup()’: RadioNeo:16: error: passing ‘const RF24Network’ as ‘this’ argument of ‘void RF24Network::begin(uint8_t, uint16_t)’ discards qualifiers [-fpermissive].

main.cc:5:45: error: passing ‘const std::vector’ as ‘this’ argument. _Alloc>::value_type = int]’ discards qualifiers [-fpermissive] auto funct = test{ test[0].push_back(1);

passing 'const this argument discards qualifiers [-fpermissive]. passing argument n discards. Error passing argument 2 of 'crypto_compress_setup.

Im getting this error: error: passing ‘const matrix’ as ‘this’ argument of ‘float& matrix::operator’ discards qualifiers [-fpermissive]. (problem with rez[i]=M[i]+A[i];) Thanks for your help. class matrix { //. float& operator[](int i); float operator.

Syntax Error Unexpected T_var Expecting T_variable backupbuddy.php on line xxx; 1.22 Backed up files link shows 404 error; 1.23 Change backups folder/file permissions or verify. when "Next Step" is clicked; 2.4 Parse error: syntax error, unexpected

c++ – error: passing 'const.'' as 'this' argument of '.' discards qualifiers – Sep 29, 2013. The error message tells you that you that you are casting of const from your object in operator< function. You should add const to all member.

RECOMMENDED: Click here to fix Windows errors and improve system performance