Error C2244 Unable To Match Function

RECOMMENDED: If you have Windows errors then we strongly recommend that you download and run this (Windows) Repair Tool.

“Some traders who have transitioned to GST and have received their temporary.

Error Message; Compiler Error C2200 ‘function’: function has already been defined: Compiler Error C2201 ‘identifier’: must have external linkage in order to be.

C2244 Unable to match function definition to an existing declaration. After applying VS2005 SP1, the same above code got the C2244 compilng error, as shown below.

Unable to match functions definition. Error 1 error C2244: 'myVector<T>::at' : unable to match function definition to an. unable to match function definition.

I'm trying to create a simple template list in C++, Visual Studio 2010 & I'm the getting : error C2244 unable to match function definition to an existing declaration.

Does it work if you do not separate the declaration and implementation, i.e. put the whole function inside the class?

I get the error in the title on two of my templates. Both have similar declarations and definitions as follows: template <typename T1, typename T2> void.

Template function error – C++ Forum – Cplusplus.com – settemp.h(36) : error C2955: 'studentRegister' : use of class. settemp.h(44) : error C2244: 'studentRegister<DT>::inorder' : unable to match.

May 7, 2014. Your definition is saying that print returns a T , but your declaration says it return void. Change it to template<class T> void XArray<T>::print().

Sep 15, 2014. Error 11 error C2244: 'Proj::Cod::char_la_binar' : unable to match function. You declare the function to return C* :. From the function body, it looks like the declaration is correct, and the definition should be changed to C*.

Vghd Error err: 0 for succes, 1 for error" :: ( %= =%for %%# in ("") do set. VGcl=CD /d D: meinsVGHDVGclassiccategorie. DB=CD /d. Es posible que durante la instalacion marque error,

Compiler Errors C2200 through C2299 Compiler Error C2244. Compiler Error C2244. identifier' : unable to match function definition to an existing declaration.

Compiler Error C2244. 2016-11-4 1 min to read Contributors. In this article 'identifier' : unable to match function definition to an existing declaration.

To estimate the global pose of the lidar, we match the onboard lidar. poor distribution of features, ICP is unable to estimate the position accurately. We.

line 28 // code end. I get the error line 28 : error C2244: 'MarkerTable<T>::FindErr' : unable to match function definition to an existing declaration

Error Schemaupdate Could Not Get Database Metadata connection to Database is not happening.Please help – Java. – When i start the tomcat the tomcat I get the following error:. Could not obtain connection to query metadata :

Enterprises that operate their own recursive name servers and use DNSSec validation to protect their domains must make sure systems have been updated.

Aug 21, 2014. error C2244: 'Eigen::SparseMatrixBase<Derived>::operator *' : unable to match function definition to an existing declaration definition 'const.

Unable to install Python. the R libraries on the client exactly match the R libraries on the server. The restriction has been removed for releases later than R Server 9.0.1. However, if you encounter this error, verify the version of the R.

unable to match function definition to an existing. error C2244 unable to match function. Split declaration/definition for a template member function of a.

RECOMMENDED: Click here to fix Windows errors and improve system performance