Collect2 Error

RECOMMENDED: If you have Windows errors then we strongly recommend that you download and run this (Windows) Repair Tool.

Apr 25, 2017. /usr/bin/ld: cannot find -lvmcs_rpc_client collect2: error: ld returned 1 exit. make[ 2]: *** [build/release-linux-arm/ioquake3.arm] Error 1 make[2]:.

Error: "error: ld returned 1 exit status. Learn more about error, simulink, function block, error: ld returned 1 exit status, c code Simulink, MATLAB

I see the error collect2: error: ld returned 1 exit status very often. For example, I was executing the following snippet of code: void main() { char i; printf.

Problem: Linking no longer functions because the collect2 program reports that the ‘ld’ program can no longer be found. "collect2: cannot find `ld’" I have.

I tried to search for that bug online but all the posts are for C++. This is the message: test1.o: In function ReadDictionary': /home/johnny/Desktop/haggai/test1.c.

Error Gears Of War Wargame-g4wlive.exe Has anyone hear ever had the problem wargame-g4wlive.exe on gears of war for pc. The game doesn't even start and the message comes out. I installed My Gears Of War

May 2, 2017. Hi dear axo patchers! I have made a large synth patch. The cpu is 50%. First it was when i used a envelope follower. After deleting other things.

collect2: error: ld returned 1 exit status. Makefile:2183: recipe for target 'pdftopdf' failed make[1]: *** [pdftopdf] Error 1 make[1]: Leaving directory.

How to install R version 3.2.1 – collect2: error: ld returned 1 exit status. up vote 2 down vote favorite. 1. I'm trying to install R version 3.2.1.

Your message dated Fri, 25 Aug 2017 12:19:13 +0000 with message-id <[email protected]> and.

Dae Error 1133 Pro Tools This Pro Tools tutorial. Pro Tools Tutorial: Understanding Error. \Program Files\Common Files\Digidesign\DAE\DAE Prefs. Get rid of those and boot up Pro. physical capital – Home; Adam smith; capital asset; depreciation;

File format not recognized collect2.exe: error: ld returned 1 exit status CMakeFilesreturncode_example.dirbuild.make:108: recipe for target ‘bin/returncode_example.exe’ failed mingw32.

sorry for everything ;), I just started playing with compiling gcc. I have Fedora 8, I have some software I’m writing, I’m trying to switch to gcc 4.4.x because of some previous bugs in gcc. Anyway, I compiled gcc and g++, here is the version.

Mar 9, 2015. bin/xc32-ld.exe Error: A heap is required, but has not been specified collect2: ld returned 255 exit status. X.production.hex] Error 255 make[1]:.

ld returned 1 exit status make[1]: *** [collect2.exe] Error 1 make[1]: Leaving directory `/usr/src/gcc-2.95.3/gcc’ make: *** [all-gcc] Error 2 This needs to be fixed in GCC mainlne. Regards. Nitin. And the other half…. fixincl.c:316: error:.

Jul 12, 2011  · I have latest qt to a ubuntu system.I am taking this error collect2: ld returned 1 exit status in build issues and this in compile output /usr/bin/ld: cannot find.

Help with collect2.exe: error id returned 1 exit status : arduino – Reddit – Hello, A project from the YouTuber Seytonic has lead me to buy a nodeMCU, when trying to compile a program for this device it gives me the.

Sep 16, 2011  · 3- running ‘ns-dtsn simple.tcl’ shows the nam window and everything along with the output shown in the attached file but.

Certificate Installation Failed Error Certificate error when installing, upgrading, or removing Endpoint. – Nov 2, 2016. The installation of the Symantec Endpoint Protection (SEP) client fails with a certificate error. Additionally if you try

RECOMMENDED: Click here to fix Windows errors and improve system performance